Reaction Details
TargetSigma non-opioid intracellular receptor 1
LigandBDBM50064171
Substrate/Competitorn/a
Meas. Tech.ChEMBL_200978 (CHEMBL802065)
Ki 0.62±n/a nM
Citation Quaglia, WGiannella, MPiergentili, APigini, MBrasili, LDi Toro, RRossetti, LSpampinato, SMelchiorre, C 1'-Benzyl-3,4-dihydrospiro[2H-1- benzothiopyran-2,4'-piperidine] (spipethiane), a potent and highly selective sigma1 ligand. J Med Chem41:1557-60 (1998) 
 
Sigma non-opioid intracellular receptor 1
Name:Sigma non-opioid intracellular receptor 1
Type:Enzyme Catalytic Domain
Mol. Mass.:25124.85
Organism:Homo sapiens (Human)
Description:Q99720
Residue:223
BDBM50064171
NameBDBM50064171
Synonyms:1'-benzylspiro[3,4-dihydro-2H-chromene-2,4'-(hexahydropyridine)] CHEMBL38634
TypeSmall organic molecule
Emp. Form.C20H23NO
Mol. Mass.293.4027
SMILESC(N1CCC2(CC1)CCc1ccccc1O2)c1ccccc1