Reaction Details
TargetD(2) dopamine receptor
LigandBDBM50036764
Substrate/Competitorn/a
Meas. Tech.ChEMBL_62573 (CHEMBL671504)
Ki 5500±n/a nM
Citation Quaglia, WGiannella, MPiergentili, APigini, MBrasili, LDi Toro, RRossetti, LSpampinato, SMelchiorre, C 1'-Benzyl-3,4-dihydrospiro[2H-1- benzothiopyran-2,4'-piperidine] (spipethiane), a potent and highly selective sigma1 ligand. J Med Chem41:1557-60 (1998) 
 
D(2) dopamine receptor
Name:D(2) dopamine receptor
Type:G Protein-Coupled Receptor (GPCR)
Mol. Mass.:50931.60
Organism:Rattus norvegicus (rat)
Description:P61169
Residue:444
BDBM50036764
NameBDBM50036764
Synonyms:1'-benzylspiro[1,2,3,4-tetrahydronaphthalene-2,4'-(hexahydropyridine)]-1-one; hydrochloride CHEMBL554874
TypeSmall organic molecule
Emp. Form.C21H23NO
Mol. Mass.305.4134
SMILESO=C1c2ccccc2CCC11CCN(Cc2ccccc2)CC1