Reaction Details
TargetV-type proton ATPase subunit B, kidney isoform
LigandBDBM50064185
Substrate/Competitorn/a
Meas. Tech.ChEMBL_210947 (CHEMBL813071)
IC50 3000±n/a nM
Citation Gagliardi, SNadler, GConsolandi, EParini, CMorvan, MLegave, MNBelfiore, PZocchetti, AClarke, GDJames, INambi, PGowen, MFarina, C 5-(5,6-Dichloro-2-indolyl)-2-methoxy-2,4-pentadienamides: novel and selective inhibitors of the vacuolar H+-ATPase of osteoclasts with bone antiresorptive activity. J Med Chem41:1568-73 (1998) 
 
V-type proton ATPase subunit B, kidney isoform
Name:V-type proton ATPase subunit B, kidney isoform
Type:PROTEIN
Mol. Mass.:56825.34
Organism:Homo sapiens (Human)
Description:ChEMBL_210947
Residue:513
BDBM50064185
NameBDBM50064185
Synonyms:(2Z,4E)-5-(5,6-Dichloro-1H-indol-2-yl)-2-methoxy-penta-2,4-dienoic acid (3-diethylamino-propyl)-amide | CHEMBL39485
TypeSmall organic molecule
Emp. Form.C21H27Cl2N3O2
Mol. Mass.424.364
SMILESCCN(CC)CCCNC(=O)C(\OC)=C\C=C\c1cc2cc(Cl)c(Cl)cc2[nH]1