Reaction Details
TargetV-type proton ATPase subunit B, kidney isoform
LigandBDBM50064184
Substrate/Competitorn/a
Meas. Tech.ChEMBL_210947 (CHEMBL813071)
IC50 1320±n/a nM
Citation Gagliardi, SNadler, GConsolandi, EParini, CMorvan, MLegave, MNBelfiore, PZocchetti, AClarke, GDJames, INambi, PGowen, MFarina, C 5-(5,6-Dichloro-2-indolyl)-2-methoxy-2,4-pentadienamides: novel and selective inhibitors of the vacuolar H+-ATPase of osteoclasts with bone antiresorptive activity. J Med Chem41:1568-73 (1998) 
 
V-type proton ATPase subunit B, kidney isoform
Name:V-type proton ATPase subunit B, kidney isoform
Type:PROTEIN
Mol. Mass.:56825.34
Organism:Homo sapiens (Human)
Description:ChEMBL_210947
Residue:513
BDBM50064184
NameBDBM50064184
Synonyms:(2Z,4E)-5-(5,6-Dichloro-1H-indol-2-yl)-2-methoxy-penta-2,4-dienoic acid ((1S,5R)-8-methyl-8-aza-bicyclo[3.2.1]oct-3-yl)-amide | CHEMBL288419
TypeSmall organic molecule
Emp. Form.C22H25Cl2N3O2
Mol. Mass.434.359
SMILESCO\C(=C/C=C/c1cc2cc(Cl)c(Cl)cc2[nH]1)C(=O)NC1C[C@@H]2CC[C@H](C1)N2C