Reaction Details
TargetV-type proton ATPase subunit B, kidney isoform
LigandBDBM50064181
Substrate/Competitorn/a
Meas. Tech.ChEMBL_210947 (CHEMBL813071)
IC50 100±n/a nM
Citation Gagliardi, SNadler, GConsolandi, EParini, CMorvan, MLegave, MNBelfiore, PZocchetti, AClarke, GDJames, INambi, PGowen, MFarina, C 5-(5,6-Dichloro-2-indolyl)-2-methoxy-2,4-pentadienamides: novel and selective inhibitors of the vacuolar H+-ATPase of osteoclasts with bone antiresorptive activity. J Med Chem41:1568-73 (1998) 
 
V-type proton ATPase subunit B, kidney isoform
Name:V-type proton ATPase subunit B, kidney isoform
Type:PROTEIN
Mol. Mass.:56825.34
Organism:Homo sapiens (Human)
Description:ChEMBL_210947
Residue:513
BDBM50064181
NameBDBM50064181
Synonyms:(2E,4E)-5-(1H-Indol-2-yl)-2-methoxy-penta-2,4-dienoic acid methyl ester | CHEMBL291117
TypeSmall organic molecule
Emp. Form.C15H15NO3
Mol. Mass.257.2845
SMILESCOC(=O)C(\OC)=C/C=C/c1cc2ccccc2[nH]1