Reaction Details
TargetRetinoic acid receptor beta
LigandBDBM50064254
Substrate/Competitorn/a
Meas. Tech.ChEMBL_195641 (CHEMBL795959)
IC50 8±n/a nM
Citation Muccio, DDBrouillette, WJBreitman, TRTaimi, MEmanuel, PDZhang, XChen, GSani, BPVenepally, PReddy, LAlam, MSimpson-Herren, LHill, DL Conformationally defined retinoic acid analogues. 4. Potential new agents for acute promyelocytic and juvenile myelomonocytic leukemias. J Med Chem41:1679-87 (1998) 
 
Retinoic acid receptor beta
Name:Retinoic acid receptor beta
Type:PROTEIN
Mol. Mass.:53344.93
Organism:Mus musculus
Description:ChEMBL_195641
Residue:482
BDBM50064254
NameBDBM50064254
Synonyms:(2E,4E,6E,8Z)-3,7-Dimethyl-9-(2,6,6-trimethyl-cyclohex-1-enyl)-nona-2,4,6,8-tetraenoic acid | CHEMBL44478
TypeSmall organic molecule
Emp. Form.C20H28O2
Mol. Mass.300.4351
SMILESC\C(\C=C/C1=C(C)CCCC1(C)C)=C/C=C/C(/C)=C/C(O)=O