Reaction Details
TargetRetinoic acid receptor beta
LigandBDBM31883
Substrate/Competitorn/a
Meas. Tech.ChEMBL_195641 (CHEMBL795959)
IC50 5±n/a nM
Citation Muccio, DDBrouillette, WJBreitman, TRTaimi, MEmanuel, PDZhang, XChen, GSani, BPVenepally, PReddy, LAlam, MSimpson-Herren, LHill, DL Conformationally defined retinoic acid analogues. 4. Potential new agents for acute promyelocytic and juvenile myelomonocytic leukemias. J Med Chem41:1679-87 (1998) 
 
Retinoic acid receptor beta
Name:Retinoic acid receptor beta
Type:PROTEIN
Mol. Mass.:53344.93
Organism:Mus musculus
Description:ChEMBL_195641
Residue:482
BDBM31883
NameBDBM31883
Synonyms:9-cis-retinoic acid (9cRA) AT-RA CHEMBL38 SMR000058245 Vitamin A acid [3H]Retinoic acid [3H]tretinoin cid_444795
Typeradiolabeled ligand
Emp. Form.C20H28O2
Mol. Mass.300.4351
SMILESC\C(\C=C\C1=C(C)CCCC1(C)C)=C/C=C/C(/C)=C/C(O)=O