Reaction Details
TargetRetinoic acid receptor alpha
LigandBDBM50064250
Substrate/Competitorn/a
Meas. Tech.ChEMBL_195186 (CHEMBL802719)
IC50 35±n/a nM
Citation Muccio, DDBrouillette, WJBreitman, TRTaimi, MEmanuel, PDZhang, XChen, GSani, BPVenepally, PReddy, LAlam, MSimpson-Herren, LHill, DL Conformationally defined retinoic acid analogues. 4. Potential new agents for acute promyelocytic and juvenile myelomonocytic leukemias. J Med Chem41:1679-87 (1998) 
 
Retinoic acid receptor alpha
Name:Retinoic acid receptor alpha
Type:PROTEIN
Mol. Mass.:50742.79
Organism:Mus musculus
Description:ChEMBL_195182
Residue:462
BDBM50064250
NameBDBM50064250
Synonyms:(2E,4E,6E)-8-[3,4-Dihydro-2H-naphthalen-(1E)-ylidene]-3,7-dimethyl-octa-2,4,6-trienoic acid CHEMBL46397
TypeSmall organic molecule
Emp. Form.C20H22O2
Mol. Mass.294.3875
SMILESC\C(\C=C\C=C(/C)\C=C1/CCCc2ccccc12)=C/C(O)=O