Reaction Details
TargetAlcohol dehydrogenase 1A
LigandBDBM50064272
Substrate/Competitorn/a
Meas. Tech.ChEMBL_31168 (CHEMBL646633)
Ki 22000±n/a nM
Citation Schindler, JFBerst, KBPlapp, BV Inhibition of human alcohol dehydrogenases by formamides. J Med Chem41:1696-701 (1998) 
 
Alcohol dehydrogenase 1A
Name:Alcohol dehydrogenase 1A
Type:PROTEIN
Mol. Mass.:39866.36
Organism:Homo sapiens (Human)
Description:ChEMBL_31168
Residue:375
BDBM50064272
NameBDBM50064272
Synonyms:CHEMBL296027 | N-Isopropyl-formamide
TypeSmall organic molecule
Emp. Form.C4H9NO
Mol. Mass.87.1204
SMILESCC(C)NC=O