Reaction Details
TargetAlcohol dehydrogenase 1A
LigandBDBM50064283
Substrate/Competitorn/a
Meas. Tech.ChEMBL_31168 (CHEMBL646633)
Ki 3800±n/a nM
Citation Schindler, JFBerst, KBPlapp, BV Inhibition of human alcohol dehydrogenases by formamides. J Med Chem41:1696-701 (1998) 
 
Alcohol dehydrogenase 1A
Name:Alcohol dehydrogenase 1A
Type:PROTEIN
Mol. Mass.:39866.36
Organism:Homo sapiens (Human)
Description:ChEMBL_31168
Residue:375
BDBM50064283
NameBDBM50064283
Synonyms:CHEMBL49774 | N-Cyclobutyl-formamide
TypeSmall organic molecule
Emp. Form.C5H9NO
Mol. Mass.99.1311
SMILESO=CNC1CCC1