Reaction Details
TargetAlcohol dehydrogenase 1A
LigandBDBM50064277
Substrate/Competitorn/a
Meas. Tech.ChEMBL_31168 (CHEMBL646633)
Ki 5500±n/a nM
Citation Schindler, JFBerst, KBPlapp, BV Inhibition of human alcohol dehydrogenases by formamides. J Med Chem41:1696-701 (1998) 
 
Alcohol dehydrogenase 1A
Name:Alcohol dehydrogenase 1A
Type:PROTEIN
Mol. Mass.:39866.36
Organism:Homo sapiens (Human)
Description:ChEMBL_31168
Residue:375
BDBM50064277
NameBDBM50064277
Synonyms:CHEMBL45705 | N-Cyclohexyl-N-methyl-formamide
TypeSmall organic molecule
Emp. Form.C8H15NO
Mol. Mass.141.2108
SMILESCN(C=O)C1CCCCC1