Reaction Details
TargetAll-trans-retinol dehydrogenase [NAD(+)] ADH1B
LigandBDBM50064269
Substrate/Competitorn/a
Meas. Tech.ChEMBL_31169 (CHEMBL641134)
Ki 11000±n/a nM
Citation Schindler, JFBerst, KBPlapp, BV Inhibition of human alcohol dehydrogenases by formamides. J Med Chem41:1696-701 (1998) 
 
All-trans-retinol dehydrogenase [NAD(+)] ADH1B
Name:All-trans-retinol dehydrogenase [NAD(+)] ADH1B
Type:PROTEIN
Mol. Mass.:39864.68
Organism:Homo sapiens (Human)
Description:ChEMBL_31169
Residue:375
BDBM50064269
NameBDBM50064269
Synonyms:CHEMBL45466 | N-Butyl-formamide
TypeSmall organic molecule
Emp. Form.C5H11NO
Mol. Mass.101.1469
SMILESCCCCNC=O