Reaction Details
TargetAlcohol dehydrogenase 1A
LigandBDBM50064271
Substrate/Competitorn/a
Meas. Tech.ChEMBL_31168 (CHEMBL646633)
Ki 880.0±n/a nM
Citation Schindler, JFBerst, KBPlapp, BV Inhibition of human alcohol dehydrogenases by formamides. J Med Chem41:1696-701 (1998) 
 
Alcohol dehydrogenase 1A
Name:Alcohol dehydrogenase 1A
Type:PROTEIN
Mol. Mass.:39866.36
Organism:Homo sapiens (Human)
Description:ChEMBL_31168
Residue:375
BDBM50064271
NameBDBM50064271
Synonyms:CHEMBL45704 | N-Cyclopentyl-N-cyclopropyl-formamide
TypeSmall organic molecule
Emp. Form.C9H15NO
Mol. Mass.153.2215
SMILESO=CN(C1CC1)C1CCCC1