Reaction Details
TargetAlcohol dehydrogenase 1A
LigandBDBM50064287
Substrate/Competitorn/a
Meas. Tech.ChEMBL_31168 (CHEMBL646633)
Ki 1900±n/a nM
Citation Schindler, JFBerst, KBPlapp, BV Inhibition of human alcohol dehydrogenases by formamides. J Med Chem41:1696-701 (1998) 
 
Alcohol dehydrogenase 1A
Name:Alcohol dehydrogenase 1A
Type:PROTEIN
Mol. Mass.:39866.36
Organism:Homo sapiens (Human)
Description:ChEMBL_31168
Residue:375
BDBM50064287
NameBDBM50064287
Synonyms:CHEMBL46655 | N-Cyclopropyl-N-heptyl-formamide
TypeSmall organic molecule
Emp. Form.C11H21NO
Mol. Mass.183.2905
SMILESCCCCCCCN(C=O)C1CC1