Reaction Details
TargetAll-trans-retinol dehydrogenase [NAD(+)] ADH4
LigandBDBM50064270
Substrate/Competitorn/a
Meas. Tech.ChEMBL_31171 (CHEMBL641136)
Ki 7100±n/a nM
Citation Schindler, JFBerst, KBPlapp, BV Inhibition of human alcohol dehydrogenases by formamides. J Med Chem41:1696-701 (1998) 
 
All-trans-retinol dehydrogenase [NAD(+)] ADH4
Name:All-trans-retinol dehydrogenase [NAD(+)] ADH4
Type:PROTEIN
Mol. Mass.:40228.36
Organism:Homo sapiens (Human)
Description:ChEMBL_31171
Residue:380
BDBM50064270
NameBDBM50064270
Synonyms:CHEMBL291214 | N-Cyclohexylmethyl-formamide
TypeSmall organic molecule
Emp. Form.C8H15NO
Mol. Mass.141.2108
SMILESO=CNCC1CCCCC1