Reaction Details
TargetNeutrophil elastase
LigandBDBM50064314
Substrate/Competitorn/a
Meas. Tech.ChEMBL_63486 (CHEMBL674777)
Ki 4.02±n/a nM
KOFF 0.0000628 s-1
KON 15600 M-1s-1
Citation Gütschow, MNeumann, U Novel thieno[2,3-d][1,3]oxazin-4-ones as inhibitors of human leukocyte elastase. J Med Chem41:1729-40 (1998) 
 
Neutrophil elastase
Name:Neutrophil elastase
Type:Enzyme
Mol. Mass.:28532.38
Organism:Homo sapiens (Human)
Description:P08246
Residue:267
BDBM50064314
NameBDBM50064314
Synonyms:5,6-Dimethyl-2-propoxy-thieno[2,3-d][1,3]oxazin-4-one | CHEMBL299381
TypeSmall organic molecule
Emp. Form.C11H13NO3S
Mol. Mass.239.291
SMILESCCCOc1nc2sc(C)c(C)c2c(=O)o1