Reaction Details
TargetNeutrophil elastase
LigandBDBM50064317
Substrate/Competitorn/a
Meas. Tech.ChEMBL_63486 (CHEMBL674777)
Ki 51±n/a nM
KOFF 0.0000515 s-1
KON 1010 M-1s-1
Citation Gütschow, MNeumann, U Novel thieno[2,3-d][1,3]oxazin-4-ones as inhibitors of human leukocyte elastase. J Med Chem41:1729-40 (1998) 
 
Neutrophil elastase
Name:Neutrophil elastase
Type:Enzyme
Mol. Mass.:28532.38
Organism:Homo sapiens (Human)
Description:P08246
Residue:267
BDBM50064317
NameBDBM50064317
Synonyms:2-Isobutoxy-5,6,7,8-tetrahydro-benzo[4,5]thieno[2,3-d][1,3]oxazin-4-one | CHEMBL298402
TypeSmall organic molecule
Emp. Form.C14H17NO3S
Mol. Mass.279.355
SMILESCC(C)COc1nc2sc3CCCCc3c2c(=O)o1