Reaction Details
TargetMatrix metalloproteinase-9
LigandBDBM50064341
Substrate/Competitorn/a
Meas. Tech.ChEMBL_105662 (CHEMBL718975)
Ki 1.8±n/a nM
Citation Xue, CBHe, XRoderick, JDeGrado, WFCherney, RJHardman, KDNelson, DJCopeland, RAJaffee, BDDecicco, CP Design and synthesis of cyclic inhibitors of matrix metalloproteinases and TNF-alpha production. J Med Chem41:1745-8 (1998) 
 
Matrix metalloproteinase-9
Name:Matrix metalloproteinase-9
Type:Enzyme
Mol. Mass.:78452.28
Organism:Homo sapiens (Human)
Description:P14780
Residue:707
BDBM50064341
NameBDBM50064341
Synonyms:(6S,7R,10S)-7-Isobutyl-8-oxo-2-oxa-9-aza-bicyclo[10.2.2]hexadeca-1(15),12(16),13-triene-6,10-dicarboxylic acid 6-hydroxyamide 10-methylamide CHEMBL45631
TypeSmall organic molecule
Emp. Form.C21H31N3O5
Mol. Mass.405.4879
SMILESCNC(=O)[C@@H]1Cc2ccc(OCCC[C@@H]([C@@H](CC(C)C)C(=O)N1)C(=O)NO)cc2