Reaction Details
TargetProto-oncogene tyrosine-protein kinase Src
LigandBDBM3096
Substrate/Competitorn/a
Meas. Tech.ChEMBL_216860 (CHEMBL816697)
IC50 9.0±n/a nM
Citation Trumpp-Kallmeyer, SRubin, JRHumblet, CHamby, JMHollis Showalter, HD Development of a binding model to protein tyrosine kinases for substituted pyrido[2,3-d]pyrimidine inhibitors. J Med Chem41:1752-63 (1998) 
 
Proto-oncogene tyrosine-protein kinase Src
Name:Proto-oncogene tyrosine-protein kinase Src
Type:Tyr protein kinase
Mol. Mass.:60015.36
Organism:Gallus gallus (Chicken)
Description:P00523
Residue:533
BDBM3096
NameBDBM3096
Synonyms:2-aminopyrido[2,3-d]pyrimidin-7(8H)-one deriv. 6-(2,6-dichlorophenyl)-2-({4-[2-(diethylamino)ethoxy]phenyl}amino)-8-methyl-7H,8H-pyrido[2,3-d]pyrimidin-7-one D3RKN_84 | PD166285
TypeSmall organic molecule
Emp. Form.C26H27Cl2N5O2
Mol. Mass.512.431
SMILESCCN(CC)CCOc1ccc(Nc2ncc3cc(-c4c(Cl)cccc4Cl)c(=O)n(C)c3n2)cc1