Reaction Details
TargetDelta-type opioid receptor
LigandBDBM50454930
Substrate/Competitorn/a
Meas. Tech.ChEMBL_147174 (CHEMBL754473)
Ki 827±n/a nM
Citation Thomas, JBMascarella, SWRothman, RBPartilla, JSXu, HMcCullough, KBDersch, CMCantrell, BEZimmerman, DMCarroll, FI Investigation of the N-substituent conformation governing potency and mu receptor subtype-selectivity in (+)-(3R, 4R)-dimethyl-4-(3-hydroxyphenyl)piperidine opioid antagonists. J Med Chem41:1980-90 (1998) 
 
Delta-type opioid receptor
Name:Delta-type opioid receptor
Type:G Protein-Coupled Receptor (GPCR)
Mol. Mass.:40465.04
Organism:Rattus norvegicus (rat)
Description:Competition binding assays were using CHO-K1 cell membranes expressing the opioid receptor.
Residue:372
BDBM50454930
NameBDBM50454930
Synonyms:CHEMBL2113734
TypeSmall organic molecule
Emp. Form.C23H29NO
Mol. Mass.335.4825
SMILESC[C@H]1CN(C[C@H]2C[C@@H]2c2ccccc2)CC[C@@]1(C)c1cccc(O)c1