Reaction Details
TargetKappa-type opioid receptor
LigandBDBM50064521
Substrate/Competitorn/a
Meas. Tech.ChEMBL_146678 (CHEMBL753170)
Ki 122±n/a nM
Citation Thomas, JBMascarella, SWRothman, RBPartilla, JSXu, HMcCullough, KBDersch, CMCantrell, BEZimmerman, DMCarroll, FI Investigation of the N-substituent conformation governing potency and mu receptor subtype-selectivity in (+)-(3R, 4R)-dimethyl-4-(3-hydroxyphenyl)piperidine opioid antagonists. J Med Chem41:1980-90 (1998) 
 
Kappa-type opioid receptor
Name:Kappa-type opioid receptor
Type:G Protein-Coupled Receptor (GPCR)
Mol. Mass.:42744.99
Organism:Cavia porcellus (domestic guinea pig)
Description:P41144
Residue:380
BDBM50064521
NameBDBM50064521
Synonyms:3-[(3R,4R)-3,4-Dimethyl-1-((E)-3-phenyl-allyl)-piperidin-4-yl]-phenol CHEMBL51838
TypeSmall organic molecule
Emp. Form.C22H27NO
Mol. Mass.321.4559
SMILESC[C@H]1CN(C\C=C\c2ccccc2)CC[C@@]1(C)c1cccc(O)c1