Reaction Details
TargetAlpha-1A adrenergic receptor
LigandBDBM50001884
Substrate/Competitorn/a
Meas. Tech.ChEMBL_33583 (CHEMBL647134)
IC50 160±n/a nM
Citation Taverne, TDiouf, ODepreux, PPoupaert, JHLesieur, DGuardiola-Lemaître, BRenard, PRettori, MCCaignard, DHPfeiffer, B Novel benzothiazolin-2-one and benzoxazin-3-one arylpiperazine derivatives with mixed 5HT1A/D2 affinity as potential atypical antipsychotics. J Med Chem41:2010-8 (1998) 
 
Alpha-1A adrenergic receptor
Name:Alpha-1A adrenergic receptor
Type:Enzyme Catalytic Domain
Mol. Mass.:51492.08
Organism:CALF
Description:adrenergic Alpha1 0 CALF
Residue:466
BDBM50001884
NameBDBM50001884
Synonyms:2-[4-(4-Methyl-benzyl)-piperazin-1-yl]-1-(2-methyl-2,3-dihydro-indol-1-yl)-ethanone 3-chloro-6-(4-methyl-piperazin-1-yl)-5H-dibenzo[b,e][1,4]diazepine 8-Chloro-11-(4-methyl-piperazin-1-yl)-5H-dibenzo[b,e][1,4]diazepine( Clozepine ) 8-Chloro-11-(4-methyl-piperazin-1-yl)-5H-dibenzo[b,e][1,4]diazepine(Clopazine) 8-chloro-11-(4-methylpiperazin-1-yl)-5H-dibenzo[b,e][1,4]diazepine CHEMBL538973 CLOZAPINE, 8-CHLORO-11-(4-METHYL-PIPERAZIN-1-YL)-5H-DIBENZO[B,E][1,4]DIAZEPINE HF 1854 US10752588, Compound Clozapine | US11498896, Compound Clozapine
TypeSmall organic molecule
Emp. Form.C18H19ClN4
Mol. Mass.326.823
SMILESCN1CCN(CC1)C1=Nc2cc(Cl)ccc2Nc2ccccc12