Reaction Details
TargetGag-Pol polyprotein [489-587]
LigandBDBM175
Substrate/Competitorn/a
Meas. Tech.ChEMBL_157717 (CHEMBL763391)
Ki 0.037±n/a nM
Citation Han, QChang, CHLi, RRu, YJadhav, PKLam, PY Cyclic HIV protease inhibitors: design and synthesis of orally bioavailable, pyrazole P2/P2' cyclic ureas with improved potency. J Med Chem41:2019-28 (1998) 
 
Gag-Pol polyprotein [489-587]
Name:Gag-Pol polyprotein [489-587]
Type:Enzyme Subunit
Mol. Mass.:10781.16
Organism:Human immunodeficiency virus type 1
Description:P04585[489-587]
Residue:99
BDBM175
NameBDBM175
Synonyms:(4R,5S,6S,7R)-4,7-dibenzyl-5,6-dihydroxy-1,3-bis({[3-(2,2,2-trifluoroacetyl)phenyl]methyl})-1,3-diazepan-2-one CHEMBL292631 | Cyclic Urea
Typen/a
Emp. Form.C37H32F6N2O5
Mol. Mass.698.6508
SMILESO[C@@H]1[C@@H](O)[C@@H](Cc2ccccc2)N(Cc2cccc(c2)C(=O)C(F)(F)F)C(=O)N(Cc2cccc(c2)C(=O)C(F)(F)F)[C@@H]1Cc1ccccc1