Reaction Details
Target5-hydroxytryptamine receptor 2C
LigandBDBM50064703
Substrate/Competitorn/a
Meas. Tech.ChEMBL_2965 (CHEMBL617905)
Ki 2.28±n/a nM
Citation Monte, APMarona-Lewicka, DLewis, MMMailman, RBWainscott, DBNelson, DLNichols, DE Substituted naphthofurans as hallucinogenic phenethylamine-ergoline hybrid molecules with unexpected muscarinic antagonist activity. J Med Chem41:2134-45 (1998) 
 
5-hydroxytryptamine receptor 2C
Name:5-hydroxytryptamine receptor 2C
Type:G Protein-Coupled Receptor (GPCR)
Mol. Mass.:51836.79
Organism:Homo sapiens (Human)
Description:P28335
Residue:458
BDBM50064703
NameBDBM50064703
Synonyms:(R)-2-(8-Bromo-2,3,6,7-tetrahydro-benzo[1,2-b;4,5-b']difuran-4-yl)-1-methyl-ethylamine | CHEMBL305275
TypeSmall organic molecule
Emp. Form.C13H16BrNO2
Mol. Mass.298.176
SMILESC[C@@H](N)Cc1c2CCOc2c(Br)c2CCOc12