Reaction Details
TargetOxytocin receptor
LigandBDBM50064730
Substrate/Competitorn/a
Meas. Tech.ChEMBL_149175 (CHEMBL762090)
Ki 8.5±n/a nM
Citation Bell, IMErb, JMFreidinger, RMGallicchio, SNGuare, JPGuidotti, MTHalpin, RAHobbs, DWHomnick, CFKuo, MSLis, EVMathre, DJMichelson, SRPawluczyk, JMPettibone, DJReiss, DRVickers, SWilliams, PDWoyden, CJ Development of orally active oxytocin antagonists: studies on 1-(1-[4-[1-(2-methyl-1-oxidopyridin-3-ylmethyl)piperidin-4-yloxy]-2- methoxybenzoyl]piperidin-4-yl)-1,4-dihydrobenz[d][1,3]oxazin-2-one (L-372,662) and related pyridines. J Med Chem41:2146-63 (1998) 
 
Oxytocin receptor
Name:Oxytocin receptor
Type:Enzyme Catalytic Domain
Mol. Mass.:42889.28
Organism:RAT
Description:Oxytocin OXTR RAT::P70536
Residue:388
BDBM50064730
NameBDBM50064730
Synonyms:1-(1-{2-Methoxy-4-[1-(1-oxy-2-propyl-pyridin-3-ylmethyl)-piperidin-4-yloxy]-benzoyl}-piperidin-4-yl)-1,4-dihydro-benzo[d][1,3]oxazin-2-one | CHEMBL69202
TypeSmall organic molecule
Emp. Form.C35H42N4O6
Mol. Mass.614.7312
SMILESCCCc1c(CN2CCC(CC2)Oc2ccc(C(=O)N3CCC(CC3)N3C(=O)OCc4ccccc34)c(OC)c2)ccc[n+]1[O-]