Reaction Details
TargetOxytocin receptor
LigandBDBM50064738
Substrate/Competitorn/a
Meas. Tech.ChEMBL_149175 (CHEMBL762090)
Ki 3.2±n/a nM
Citation Bell, IMErb, JMFreidinger, RMGallicchio, SNGuare, JPGuidotti, MTHalpin, RAHobbs, DWHomnick, CFKuo, MSLis, EVMathre, DJMichelson, SRPawluczyk, JMPettibone, DJReiss, DRVickers, SWilliams, PDWoyden, CJ Development of orally active oxytocin antagonists: studies on 1-(1-[4-[1-(2-methyl-1-oxidopyridin-3-ylmethyl)piperidin-4-yloxy]-2- methoxybenzoyl]piperidin-4-yl)-1,4-dihydrobenz[d][1,3]oxazin-2-one (L-372,662) and related pyridines. J Med Chem41:2146-63 (1998) 
 
Oxytocin receptor
Name:Oxytocin receptor
Type:Enzyme Catalytic Domain
Mol. Mass.:42889.28
Organism:RAT
Description:Oxytocin OXTR RAT::P70536
Residue:388
BDBM50064738
NameBDBM50064738
Synonyms:1-(1-{5-Fluoro-2-methoxy-4-[1-(1-oxy-2-trifluoromethyl-pyridin-3-ylmethyl)-piperidin-4-yloxy]-benzoyl}-piperidin-4-yl)-1,4-dihydro-benzo[d][1,3]oxazin-2-one | CHEMBL303700
TypeSmall organic molecule
Emp. Form.C33H34F4N4O6
Mol. Mass.658.6399
SMILESCOc1cc(OC2CCN(Cc3ccc[n+]([O-])c3C(F)(F)F)CC2)c(F)cc1C(=O)N1CCC(CC1)N1C(=O)OCc2ccccc12