Reaction Details
TargetOxytocin receptor
LigandBDBM50064737
Substrate/Competitorn/a
Meas. Tech.ChEMBL_149043 (CHEMBL762236)
Ki 2.1±n/a nM
Citation Bell, IMErb, JMFreidinger, RMGallicchio, SNGuare, JPGuidotti, MTHalpin, RAHobbs, DWHomnick, CFKuo, MSLis, EVMathre, DJMichelson, SRPawluczyk, JMPettibone, DJReiss, DRVickers, SWilliams, PDWoyden, CJ Development of orally active oxytocin antagonists: studies on 1-(1-[4-[1-(2-methyl-1-oxidopyridin-3-ylmethyl)piperidin-4-yloxy]-2- methoxybenzoyl]piperidin-4-yl)-1,4-dihydrobenz[d][1,3]oxazin-2-one (L-372,662) and related pyridines. J Med Chem41:2146-63 (1998) 
 
Oxytocin receptor
Name:Oxytocin receptor
Type:Enzyme Catalytic Domain
Mol. Mass.:42793.26
Organism:Homo sapiens (Human)
Description:Oxytocin OXTR HEK293::B2R9L7
Residue:389
BDBM50064737
NameBDBM50064737
Synonyms:1-(1-{4-[1-(2-Ethyl-1-oxy-pyridin-3-ylmethyl)-piperidin-4-yloxy]-2-methoxy-benzoyl}-piperidin-4-yl)-1,4-dihydro-benzo[d][1,3]oxazin-2-one | CHEMBL66240
TypeSmall organic molecule
Emp. Form.C34H40N4O6
Mol. Mass.600.7046
SMILESCCc1c(CN2CCC(CC2)Oc2ccc(C(=O)N3CCC(CC3)N3C(=O)OCc4ccccc34)c(OC)c2)ccc[n+]1[O-]