Reaction Details
TargetOxytocin receptor
LigandBDBM50064740
Substrate/Competitorn/a
Meas. Tech.ChEMBL_149043 (CHEMBL762236)
Ki 2.3±n/a nM
Citation Bell, IMErb, JMFreidinger, RMGallicchio, SNGuare, JPGuidotti, MTHalpin, RAHobbs, DWHomnick, CFKuo, MSLis, EVMathre, DJMichelson, SRPawluczyk, JMPettibone, DJReiss, DRVickers, SWilliams, PDWoyden, CJ Development of orally active oxytocin antagonists: studies on 1-(1-[4-[1-(2-methyl-1-oxidopyridin-3-ylmethyl)piperidin-4-yloxy]-2- methoxybenzoyl]piperidin-4-yl)-1,4-dihydrobenz[d][1,3]oxazin-2-one (L-372,662) and related pyridines. J Med Chem41:2146-63 (1998) 
 
Oxytocin receptor
Name:Oxytocin receptor
Type:Enzyme Catalytic Domain
Mol. Mass.:42793.26
Organism:Homo sapiens (Human)
Description:Oxytocin OXTR HEK293::B2R9L7
Residue:389
BDBM50064740
NameBDBM50064740
Synonyms:1-(1-{5-Fluoro-2-methoxy-4-[1-((R)-1-oxy-5,6,7,8-tetrahydro-quinolin-5-yl)-piperidin-4-yloxy]-benzoyl}-piperidin-4-yl)-1,4-dihydro-benzo[d][1,3]oxazin-2-one | CHEMBL265070
TypeSmall organic molecule
Emp. Form.C35H39FN4O6
Mol. Mass.630.7058
SMILESCOc1cc(OC2CCN(CC2)[C@@H]2CCCc3c2ccc[n+]3[O-])c(F)cc1C(=O)N1CCC(CC1)N1C(=O)OCc2ccccc12