Reaction Details
TargetGag-Pol polyprotein [489-587]
LigandBDBM164
Substrate/Competitorn/a
Meas. Tech.ChEMBL_157733 (CHEMBL765171)
Ki 0.023±n/a nM
Citation De Lucca, GVKim, UTLiang, JCordova, BKlabe, RMGarber, SBacheler, LTLam, GNWright, MRLogue, KAErickson-Viitanen, SKo, SSTrainor, GL Nonsymmetric P2/P2' cyclic urea HIV protease inhibitors. Structure-activity relationship, bioavailability, and resistance profile of monoindazole-substituted P2 analogues. J Med Chem41:2411-23 (1998) 
 
Gag-Pol polyprotein [489-587]
Name:Gag-Pol polyprotein [489-587]
Type:Enzyme Subunit
Mol. Mass.:10781.16
Organism:Human immunodeficiency virus type 1
Description:P04585[489-587]
Residue:99
BDBM164
NameBDBM164
Synonyms:(4R,5R,6R)-4-benzyl-5-hydroxy-1,3-bis(1H-indazol-5-ylmethyl)-6-(2-phenylethyl)-1,3-diazinan-2-one Cyclic Urea | [4R-(4,5,6)]-Tetrahydro-5-hydroxy-1,3-bis(1H-indazol-5-ylmethyl)-4-(2-phenylethyl)-6-(phenylmethyl)-2(1H)-pyrimidinone
Typen/a
Emp. Form.C35H34N6O2
Mol. Mass.570.6835
SMILESO[C@@H]1[C@@H](CCc2ccccc2)N(Cc2ccc3[nH]ncc3c2)C(=O)N(Cc2ccc3[nH]ncc3c2)[C@@H]1Cc1ccccc1