Reaction Details
TargetGag-Pol polyprotein [489-587]
LigandBDBM50065089
Substrate/Competitorn/a
Meas. Tech.ChEMBL_157733 (CHEMBL765171)
Ki 0.018±n/a nM
Citation De Lucca, GVKim, UTLiang, JCordova, BKlabe, RMGarber, SBacheler, LTLam, GNWright, MRLogue, KAErickson-Viitanen, SKo, SSTrainor, GL Nonsymmetric P2/P2' cyclic urea HIV protease inhibitors. Structure-activity relationship, bioavailability, and resistance profile of monoindazole-substituted P2 analogues. J Med Chem41:2411-23 (1998) 
 
Gag-Pol polyprotein [489-587]
Name:Gag-Pol polyprotein [489-587]
Type:Enzyme Subunit
Mol. Mass.:10781.16
Organism:Human immunodeficiency virus type 1
Description:P04585[489-587]
Residue:99
BDBM50065089
NameBDBM50065089
Synonyms:(4R,5R,6R)-Tetrahydro-1,3-bis[(3-benzamide oxime)-methyl]-5-hydroxy-4-(2-phenylethyl)-6-(phenylethyl)-2-(1H)-pyrimidinone 3-[(6-Benzyl-5-hydroxy-2-oxo-4-phenethyl-tetrahydro-pyrimidin-1-yl)bis-(methyl-N-hydroxy-benzamidine)] CHEMBL284942 | Tetrahydropyrimidinone derivative
TypeSmall organic molecule
Emp. Form.C35H38N6O4
Mol. Mass.606.714
SMILESONC(=N)c1cccc(CN2[C@H](CCc3ccccc3)[C@@H](O)[C@@H](Cc3ccccc3)N(Cc3cccc(c3)C(=N)NO)C2=O)c1