Reaction Details
TargetGag-Pol polyprotein [489-587]
LigandBDBM1080
Substrate/Competitorn/a
Meas. Tech.ChEMBL_157733 (CHEMBL765171)
Ki 0.088±n/a nM
Citation De Lucca, GVKim, UTLiang, JCordova, BKlabe, RMGarber, SBacheler, LTLam, GNWright, MRLogue, KAErickson-Viitanen, SKo, SSTrainor, GL Nonsymmetric P2/P2' cyclic urea HIV protease inhibitors. Structure-activity relationship, bioavailability, and resistance profile of monoindazole-substituted P2 analogues. J Med Chem41:2411-23 (1998) 
 
Gag-Pol polyprotein [489-587]
Name:Gag-Pol polyprotein [489-587]
Type:Enzyme Subunit
Mol. Mass.:10781.16
Organism:Human immunodeficiency virus type 1
Description:P04585[489-587]
Residue:99
BDBM1080
NameBDBM1080
Synonyms:(4R,5R,6R)-Tetrahydro-1,3-bis[(3-benzamido)methyl]-5-hydroxy-4-(2-phenylethyl)-6-(phenylmethyl)-2(1H)-pyrimidinone CHEMBL284340 Tetrahydropyrimidinone deriv. 23
TypeSmall organic molecule
Emp. Form.C35H36N4O4
Mol. Mass.576.6847
SMILESNC(=O)c1cccc(CN2[C@H](CCc3ccccc3)[C@@H](O)[C@@H](Cc3ccccc3)N(Cc3cccc(c3)C(N)=O)C2=O)c1