Reaction Details
TargetVasopressin V2 receptor
LigandBDBM50065117
Substrate/Competitorn/a
Meas. Tech.ChEMBL_215174 (CHEMBL821347)
IC50 5±n/a nM
Citation Albright, JDReich, MFDelos Santos, EGDusza, JPSum, FWVenkatesan, AMCoupet, JChan, PSRu, XMazandarani, HBailey, T 5-Fluoro-2-methyl-N-[4-(5H-pyrrolo[2,1-c]-[1, 4]benzodiazepin-10(11H)-ylcarbonyl)-3-chlorophenyl]benzamide (VPA-985): an orally active arginine vasopressin antagonist with selectivity for V2 receptors. J Med Chem41:2442-4 (1998) 
 
Vasopressin V2 receptor
Name:Vasopressin V2 receptor
Type:G-protein coupled receptor
Mol. Mass.:40761.85
Organism:Rattus norvegicus (Rat)
Description:n/a
Residue:371
BDBM50065117
NameBDBM50065117
Synonyms:CHEMBL304956 | N-[4-(5H,11H-Benzo[e]pyrrolo[1,2-a][1,4]diazepine-10-carbonyl)-phenyl]-2,3-dimethyl-benzamide
TypeSmall organic molecule
Emp. Form.C28H25N3O2
Mol. Mass.435.517
SMILESCc1cccc(C(=O)Nc2ccc(cc2)C(=O)N2Cc3cccn3Cc3ccccc23)c1C