Reaction Details
TargetVasopressin V1a receptor
LigandBDBM50065121
Substrate/Competitorn/a
Meas. Tech.ChEMBL_215168 (CHEMBL821341)
IC50 54±n/a nM
Citation Albright, JDReich, MFDelos Santos, EGDusza, JPSum, FWVenkatesan, AMCoupet, JChan, PSRu, XMazandarani, HBailey, T 5-Fluoro-2-methyl-N-[4-(5H-pyrrolo[2,1-c]-[1, 4]benzodiazepin-10(11H)-ylcarbonyl)-3-chlorophenyl]benzamide (VPA-985): an orally active arginine vasopressin antagonist with selectivity for V2 receptors. J Med Chem41:2442-4 (1998) 
 
Vasopressin V1a receptor
Name:Vasopressin V1a receptor
Type:Enzyme Catalytic Domain
Mol. Mass.:47674.81
Organism:RAT
Description:VASOPRESSIN V1A AVPR1A RAT::P30560
Residue:424
BDBM50065121
NameBDBM50065121
Synonyms:CHEMBL310416 | N-[4-(5H,11H-Benzo[e]pyrrolo[1,2-a][1,4]diazepine-10-carbonyl)-3-chloro-phenyl]-2-methyl-benzamide
TypeSmall organic molecule
Emp. Form.C27H22ClN3O2
Mol. Mass.455.935
SMILESCc1ccccc1C(=O)Nc1ccc(C(=O)N2Cc3cccn3Cc3ccccc23)c(Cl)c1