Reaction Details
TargetVasopressin V2 receptor
LigandBDBM50065125
Substrate/Competitorn/a
Meas. Tech.ChEMBL_215174 (CHEMBL821347)
IC50 8.3±n/a nM
Citation Albright, JDReich, MFDelos Santos, EGDusza, JPSum, FWVenkatesan, AMCoupet, JChan, PSRu, XMazandarani, HBailey, T 5-Fluoro-2-methyl-N-[4-(5H-pyrrolo[2,1-c]-[1, 4]benzodiazepin-10(11H)-ylcarbonyl)-3-chlorophenyl]benzamide (VPA-985): an orally active arginine vasopressin antagonist with selectivity for V2 receptors. J Med Chem41:2442-4 (1998) 
 
Vasopressin V2 receptor
Name:Vasopressin V2 receptor
Type:G-protein coupled receptor
Mol. Mass.:40761.85
Organism:Rattus norvegicus (Rat)
Description:n/a
Residue:371
BDBM50065125
NameBDBM50065125
Synonyms:CHEMBL311230 | N-[4-(5H,11H-Benzo[e]pyrrolo[1,2-a][1,4]diazepine-10-carbonyl)-3-chloro-phenyl]-2,4-dichloro-benzamide
TypeSmall organic molecule
Emp. Form.C26H18Cl3N3O2
Mol. Mass.510.799
SMILESClc1ccc(C(=O)Nc2ccc(C(=O)N3Cc4cccn4Cc4ccccc34)c(Cl)c2)c(Cl)c1