Reaction Details
TargetVasopressin V2 receptor
LigandBDBM50065119
Substrate/Competitorn/a
Meas. Tech.ChEMBL_215174 (CHEMBL821347)
IC50 4±n/a nM
Citation Albright, JDReich, MFDelos Santos, EGDusza, JPSum, FWVenkatesan, AMCoupet, JChan, PSRu, XMazandarani, HBailey, T 5-Fluoro-2-methyl-N-[4-(5H-pyrrolo[2,1-c]-[1, 4]benzodiazepin-10(11H)-ylcarbonyl)-3-chlorophenyl]benzamide (VPA-985): an orally active arginine vasopressin antagonist with selectivity for V2 receptors. J Med Chem41:2442-4 (1998) 
 
Vasopressin V2 receptor
Name:Vasopressin V2 receptor
Type:G-protein coupled receptor
Mol. Mass.:40761.85
Organism:Rattus norvegicus (Rat)
Description:n/a
Residue:371
BDBM50065119
NameBDBM50065119
Synonyms:CHEMBL70981 | N-[4-(5H,11H-Benzo[e]pyrrolo[1,2-a][1,4]diazepine-10-carbonyl)-phenyl]-3-fluoro-2-methyl-benzamide
TypeSmall organic molecule
Emp. Form.C27H22FN3O2
Mol. Mass.439.4809
SMILESCc1c(F)cccc1C(=O)Nc1ccc(cc1)C(=O)N1Cc2cccn2Cc2ccccc12