Reaction Details
TargetSigma non-opioid intracellular receptor 1
LigandBDBM50065144
Substrate/Competitorn/a
Meas. Tech.ChEMBL_200969 (CHEMBL802057)
Ki 0.63±n/a nM
Citation John, CSLim, BBVilner, BJGeyer, BCBowen, WD Substituted halogenated arylsulfonamides: a new class of sigma receptor binding tumor imaging agents. J Med Chem41:2445-50 (1998) 
 
Sigma non-opioid intracellular receptor 1
Name:Sigma non-opioid intracellular receptor 1
Type:Enzyme Catalytic Domain
Mol. Mass.:25124.85
Organism:Homo sapiens (Human)
Description:Q99720
Residue:223
BDBM50065144
NameBDBM50065144
Synonyms:CHEMBL79660 | N-(2-Azepan-1-yl-ethyl)-4-bromo-benzenesulfonamide
TypeSmall organic molecule
Emp. Form.C14H21BrN2O2S
Mol. Mass.361.298
SMILESBrc1ccc(cc1)S(=O)(=O)NCCN1CCCCCC1