Reaction Details
TargetSigma non-opioid intracellular receptor 1
LigandBDBM50065135
Substrate/Competitorn/a
Meas. Tech.ChEMBL_200971 (CHEMBL882142)
Ki 1.46±n/a nM
Citation John, CSLim, BBVilner, BJGeyer, BCBowen, WD Substituted halogenated arylsulfonamides: a new class of sigma receptor binding tumor imaging agents. J Med Chem41:2445-50 (1998) 
 
Sigma non-opioid intracellular receptor 1
Name:Sigma non-opioid intracellular receptor 1
Type:Enzyme Catalytic Domain
Mol. Mass.:25124.85
Organism:Homo sapiens (Human)
Description:Q99720
Residue:223
BDBM50065135
NameBDBM50065135
Synonyms:4-Iodo-N-(2-pyrrolidin-1-yl-ethyl)-benzenesulfonamide | CHEMBL79840
TypeSmall organic molecule
Emp. Form.C12H17IN2O2S
Mol. Mass.380.245
SMILESIc1ccc(cc1)S(=O)(=O)NCCN1CCCC1