Reaction Details
TargetNeutrophil elastase
LigandBDBM50065158
Substrate/Competitorn/a
Meas. Tech.ChEMBL_63976 (CHEMBL677602)
Ki 20±n/a nM
Citation Cregge, RJDurham, SLFarr, RAGallion, SLHare, CMHoffman, RVJanusz, MJKim, HOKoehl, JRMehdi, SMetz, WAPeet, NPPelton, JTSchreuder, HASunder, STardif, C Inhibition of human neutrophil elastase. 4. Design, synthesis, X-ray crystallographic analysis, and structure-activity relationships for a series of P2-modified, orally active peptidyl pentafluoroethyl ketones. J Med Chem41:2461-80 (1998) 
 
Neutrophil elastase
Name:Neutrophil elastase
Type:Enzyme
Mol. Mass.:28532.38
Organism:Homo sapiens (Human)
Description:P08246
Residue:267
BDBM50065158
NameBDBM50065158
Synonyms:(R)-4-Benzyloxy-1-{(S)-3-methyl-2-[4-(morpholine-4-carbonyl)-benzoylamino]-butyryl}-pyrrolidine-2-carboxylic acid (3,3,4,4,4-pentafluoro-1-isopropyl-2-oxo-butyl)-amide | CHEMBL315196
TypeSmall organic molecule
Emp. Form.C36H43F5N4O7
Mol. Mass.738.7412
SMILESCC(C)[C@H](NC(=O)c1ccc(cc1)C(=O)N1CCOCC1)C(=O)N1CC(C[C@@H]1C(=O)NC(C(C)C)C(=O)C(F)(F)C(F)(F)F)OCc1ccccc1