Reaction Details
TargetMuscarinic acetylcholine receptor M1
LigandBDBM50065212
Substrate/Competitorn/a
Meas. Tech.ChEMBL_138281 (CHEMBL744238)
IC50 1620±n/a nM
Citation Tecle, HBarrett, SDLauffer, DJAugelli-Szafran, CBrann, MRCallahan, MJCaprathe, BWDavis, REDoyle, PDEubanks, DLipiniski, WMirzadegan, TMoos, WHMoreland, DWNelson, CBPavia, MRRaby, CSchwarz, RDSpencer, CJThomas, AJJaen, JC Design and synthesis of m1-selective muscarinic agonists: (R)-(-)-(Z)-1-Azabicyclo[2.2.1]heptan-3-one, O-(3-(3'-methoxyphenyl)-2-propynyl)oxime maleate (CI-1017), a functionally m1-selective muscarinic agonist. J Med Chem41:2524-36 (1998) 
 
Muscarinic acetylcholine receptor M1
Name:Muscarinic acetylcholine receptor M1
Type:Protein
Mol. Mass.:51442.54
Organism:Homo sapiens (Human)
Description:P11229
Residue:460
BDBM50065212
NameBDBM50065212
Synonyms:1-Aza-bicyclo[2.2.1]heptan-3-one O-(3-thiophen-2-yl-prop-2-ynyl)-oxime | CHEMBL85936
TypeSmall organic molecule
Emp. Form.C13H14N2OS
Mol. Mass.246.328
SMILESC(O\N=C1/CN2CCC1C2)C#Cc1cccs1