Reaction Details
TargetMuscarinic acetylcholine receptor M1
LigandBDBM50065220
Substrate/Competitorn/a
Meas. Tech.ChEMBL_138281 (CHEMBL744238)
IC50 10600±n/a nM
Citation Tecle, HBarrett, SDLauffer, DJAugelli-Szafran, CBrann, MRCallahan, MJCaprathe, BWDavis, REDoyle, PDEubanks, DLipiniski, WMirzadegan, TMoos, WHMoreland, DWNelson, CBPavia, MRRaby, CSchwarz, RDSpencer, CJThomas, AJJaen, JC Design and synthesis of m1-selective muscarinic agonists: (R)-(-)-(Z)-1-Azabicyclo[2.2.1]heptan-3-one, O-(3-(3'-methoxyphenyl)-2-propynyl)oxime maleate (CI-1017), a functionally m1-selective muscarinic agonist. J Med Chem41:2524-36 (1998) 
 
Muscarinic acetylcholine receptor M1
Name:Muscarinic acetylcholine receptor M1
Type:Protein
Mol. Mass.:51442.54
Organism:Homo sapiens (Human)
Description:P11229
Residue:460
BDBM50065220
NameBDBM50065220
Synonyms:1-Aza-bicyclo[2.2.1]heptan-3-one O-[3-(4-methoxy-phenyl)-prop-2-ynyl]-oxime | CHEMBL84919
TypeSmall organic molecule
Emp. Form.C16H18N2O2
Mol. Mass.270.3263
SMILESCOc1ccc(cc1)C#CCO\N=C1/CN2CCC1C2