Reaction Details
TargetMuscarinic acetylcholine receptor M2
LigandBDBM50065224
Substrate/Competitorn/a
Meas. Tech.ChEMBL_139625 (CHEMBL749007)
IC50 519.0±n/a nM
Citation Tecle, HBarrett, SDLauffer, DJAugelli-Szafran, CBrann, MRCallahan, MJCaprathe, BWDavis, REDoyle, PDEubanks, DLipiniski, WMirzadegan, TMoos, WHMoreland, DWNelson, CBPavia, MRRaby, CSchwarz, RDSpencer, CJThomas, AJJaen, JC Design and synthesis of m1-selective muscarinic agonists: (R)-(-)-(Z)-1-Azabicyclo[2.2.1]heptan-3-one, O-(3-(3'-methoxyphenyl)-2-propynyl)oxime maleate (CI-1017), a functionally m1-selective muscarinic agonist. J Med Chem41:2524-36 (1998) 
 
Muscarinic acetylcholine receptor M2
Name:Muscarinic acetylcholine receptor M2
Type:GPCR
Mol. Mass.:51730.61
Organism:Homo sapiens (Human)
Description:P08172
Residue:466
BDBM50065224
NameBDBM50065224
Synonyms:1-Aza-bicyclo[2.2.1]heptan-3-one O-(3-methyl-but-2-enyl)-oxime | CHEMBL82378
TypeSmall organic molecule
Emp. Form.C11H18N2O
Mol. Mass.194.2734
SMILES[#6]\[#6](-[#6])=[#6]\[#6]-[#8]\[#7]=[#6]-1/[#6]-[#7]-2-[#6]-[#6]-[#6]-1-[#6]-2