Reaction Details
TargetCytidine deaminase
LigandBDBM50065260
Substrate/Competitorn/a
Meas. Tech.ChEMBL_52535 (CHEMBL665307)
Ki 2300±n/a nM
Citation Jeong, LSBuenger, GMcCormack, JJCooney, DAHao, ZMarquez, VE Carbocyclic analogues of the potent cytidine deaminase inhibitor 1-(beta-D-ribofuranosyl)-1,2-dihydropyrimidin-2-one (zebularine). J Med Chem41:2572-8 (1998) 
 
Cytidine deaminase
Name:Cytidine deaminase
Type:Ezyme
Mol. Mass.:16185.04
Organism:Homo sapiens (Human)
Description:P32320
Residue:146
BDBM50065260
NameBDBM50065260
Synonyms:1-((3R,4S)-3,4-Dihydroxy-5-hydroxymethyl-tetrahydro-furan-2-yl)-1H-pyrimidin-2-one | CHEMBL87519
TypeSmall organic molecule
Emp. Form.C9H12N2O5
Mol. Mass.228.202
SMILESOCC1OC([C@H](O)[C@@H]1O)n1cccnc1=O