Reaction Details
TargetPlatelet-derived growth factor receptor beta
LigandBDBM50065304
Substrate/Competitorn/a
Meas. Tech.ChEMBL_158520 (CHEMBL768947)
IC50 8390.0±n/a nM
Citation Sun, LTran, NTang, FApp, HHirth, PMcMahon, GTang, C Synthesis and biological evaluations of 3-substituted indolin-2-ones: a novel class of tyrosine kinase inhibitors that exhibit selectivity toward particular receptor tyrosine kinases. J Med Chem41:2588-603 (1998) 
 
Platelet-derived growth factor receptor beta
Name:Platelet-derived growth factor receptor beta
Type:Enzyme
Mol. Mass.:123922.25
Organism:Homo sapiens (Human)
Description:P09619
Residue:1106
BDBM50065304
NameBDBM50065304
Synonyms:3-[1-(4-Hydroxy-phenyl)-meth-(Z)-ylidene]-1,3-dihydro-indol-2-one | CHEMBL313578
TypeSmall organic molecule
Emp. Form.C15H11NO2
Mol. Mass.237.2533
SMILESOc1ccc(\C=C2/C(=O)Nc3ccccc23)cc1