Reaction Details
TargetInsulin-like growth factor 1 receptor
LigandBDBM50065298
Substrate/Competitorn/a
Meas. Tech.ChEMBL_90281 (CHEMBL697346)
IC50>100000±n/a nM
Citation Sun, LTran, NTang, FApp, HHirth, PMcMahon, GTang, C Synthesis and biological evaluations of 3-substituted indolin-2-ones: a novel class of tyrosine kinase inhibitors that exhibit selectivity toward particular receptor tyrosine kinases. J Med Chem41:2588-603 (1998) 
 
Insulin-like growth factor 1 receptor
Name:Insulin-like growth factor 1 receptor
Type:Protein
Mol. Mass.:154776.79
Organism:Homo sapiens (Human)
Description:P08069
Residue:1367
BDBM50065298
NameBDBM50065298
Synonyms:3-[1-(4-Dimethylamino-phenyl)-meth-(Z)-ylidene]-6-fluoro-1,3-dihydro-indol-2-one | CHEMBL329367
TypeSmall organic molecule
Emp. Form.C17H15FN2O
Mol. Mass.282.3122
SMILESCN(C)c1ccc(\C=C2/C(=O)Nc3cc(F)ccc23)cc1