Reaction Details
TargetEpidermal growth factor receptor
LigandBDBM50065294
Substrate/Competitorn/a
Meas. Tech.ChEMBL_63615 (CHEMBL676159)
IC50>100000±n/a nM
Citation Sun, LTran, NTang, FApp, HHirth, PMcMahon, GTang, C Synthesis and biological evaluations of 3-substituted indolin-2-ones: a novel class of tyrosine kinase inhibitors that exhibit selectivity toward particular receptor tyrosine kinases. J Med Chem41:2588-603 (1998) 
 
Epidermal growth factor receptor
Name:Epidermal growth factor receptor
Type:Receptor Kinase Domain
Mol. Mass.:134279.59
Organism:Homo sapiens (Human)
Description:P00533
Residue:1210
BDBM50065294
NameBDBM50065294
Synonyms:3-(4-Dimethylamino-benzylidene)-4-methyl-1,3-dihydro-indol-2-one CHEMBL89809
TypeSmall organic molecule
Emp. Form.C18H18N2O
Mol. Mass.278.3483
SMILESCN(C)c1ccc(\C=C2/C(=O)Nc3cccc(C)c23)cc1