Reaction Details
TargetInsulin-like growth factor 1 receptor
LigandBDBM50065314
Substrate/Competitorn/a
Meas. Tech.ChEMBL_90281 (CHEMBL697346)
IC50>100000±n/a nM
Citation Sun, LTran, NTang, FApp, HHirth, PMcMahon, GTang, C Synthesis and biological evaluations of 3-substituted indolin-2-ones: a novel class of tyrosine kinase inhibitors that exhibit selectivity toward particular receptor tyrosine kinases. J Med Chem41:2588-603 (1998) 
 
Insulin-like growth factor 1 receptor
Name:Insulin-like growth factor 1 receptor
Type:Protein
Mol. Mass.:154776.79
Organism:Homo sapiens (Human)
Description:P08069
Residue:1367
BDBM50065314
NameBDBM50065314
Synonyms:3-[1-(4-Pyrrolidin-1-yl-phenyl)-meth-(Z)-ylidene]-1,3-dihydro-indol-2-one | CHEMBL314217
TypeSmall organic molecule
Emp. Form.C19H18N2O
Mol. Mass.290.359
SMILESO=C1Nc2ccccc2\C1=C\c1ccc(cc1)N1CCCC1