Reaction Details
TargetPlatelet-derived growth factor receptor beta
LigandBDBM50065290
Substrate/Competitorn/a
Meas. Tech.ChEMBL_158520 (CHEMBL768947)
IC50 24500±n/a nM
Citation Sun, LTran, NTang, FApp, HHirth, PMcMahon, GTang, C Synthesis and biological evaluations of 3-substituted indolin-2-ones: a novel class of tyrosine kinase inhibitors that exhibit selectivity toward particular receptor tyrosine kinases. J Med Chem41:2588-603 (1998) 
 
Platelet-derived growth factor receptor beta
Name:Platelet-derived growth factor receptor beta
Type:Enzyme
Mol. Mass.:123922.25
Organism:Homo sapiens (Human)
Description:P09619
Residue:1106
BDBM50065290
NameBDBM50065290
Synonyms:(Z)-4-(4-((4-methyl-2-oxoindolin-3-ylidene)methyl)phenyl)piperazine-1-carbaldehyde 4-{4-[4-Methyl-2-oxo-1,2-dihydro-indol-(3Z)-ylidenemethyl]-phenyl}-piperazine-1-carbaldehyde | CHEMBL89040
TypeSmall organic molecule
Emp. Form.C21H21N3O2
Mol. Mass.347.4103
SMILESCc1cccc2NC(=O)\C(=C/c3ccc(cc3)N3CCN(CC3)C=O)c12