Reaction Details
TargetEpidermal growth factor receptor
LigandBDBM50065295
Substrate/Competitorn/a
Meas. Tech.ChEMBL_63615 (CHEMBL676159)
IC50 44000±n/a nM
Citation Sun, LTran, NTang, FApp, HHirth, PMcMahon, GTang, C Synthesis and biological evaluations of 3-substituted indolin-2-ones: a novel class of tyrosine kinase inhibitors that exhibit selectivity toward particular receptor tyrosine kinases. J Med Chem41:2588-603 (1998) 
 
Epidermal growth factor receptor
Name:Epidermal growth factor receptor
Type:Receptor Kinase Domain
Mol. Mass.:134279.59
Organism:Homo sapiens (Human)
Description:P00533
Residue:1210
BDBM50065295
NameBDBM50065295
Synonyms:3-[1-(5-Ethyl-thiophen-2-yl)-meth-(Z)-ylidene]-1,3-dihydro-indol-2-one | CHEMBL314146
TypeSmall organic molecule
Emp. Form.C15H13NOS
Mol. Mass.255.335
SMILESCCc1ccc(\C=C2/C(=O)Nc3ccccc23)s1