Reaction Details
TargetEpidermal growth factor receptor
LigandBDBM50065292
Substrate/Competitorn/a
Meas. Tech.ChEMBL_63615 (CHEMBL676159)
IC50>100000±n/a nM
Citation Sun, LTran, NTang, FApp, HHirth, PMcMahon, GTang, C Synthesis and biological evaluations of 3-substituted indolin-2-ones: a novel class of tyrosine kinase inhibitors that exhibit selectivity toward particular receptor tyrosine kinases. J Med Chem41:2588-603 (1998) 
 
Epidermal growth factor receptor
Name:Epidermal growth factor receptor
Type:Receptor Kinase Domain
Mol. Mass.:134279.59
Organism:Homo sapiens (Human)
Description:P00533
Residue:1210
BDBM50065292
NameBDBM50065292
Synonyms:(Z)-3-(3,5-Dimethyl-1H-pyrrol-2-ylmethylene)-5-methyl-1,3-dihydro-indol-2-one 3-[1-(3,5-Dimethyl-1H-pyrrol-2-yl)-meth-(Z)-ylidene]-5-methyl-1,3-dihydro-indol-2-one | CHEMBL89483
TypeSmall organic molecule
Emp. Form.C16H16N2O
Mol. Mass.252.311
SMILESCc1cc(C)c(\C=C2/C(=O)Nc3ccc(C)cc23)[nH]1