Reaction Details
Target5-hydroxytryptamine receptor 1A
LigandBDBM50065563
Substrate/Competitorn/a
Meas. Tech.ChEMBL_1127 (CHEMBL616072)
Ki 2.10±n/a nM
Citation Yasunaga, TKimura, TNaito, RKontani, TWanibuchi, FYamashita, HNomura, TTsukamoto, SYamaguchi, TMase, T Synthesis and pharmacological characterization of novel 6-fluorochroman derivatives as potential 5-HT1A receptor antagonists. J Med Chem41:2765-78 (1998) 
 
5-hydroxytryptamine receptor 1A
Name:5-hydroxytryptamine receptor 1A
Type:G Protein-Coupled Receptor (GPCR)
Mol. Mass.:46445.29
Organism:Rattus norvegicus (rat)
Description:Binding assays were performed using rat hippocampal membranes.
Residue:422
BDBM50065563
NameBDBM50065563
Synonyms:6-Fluoro-8-{2-[4-(4-methoxy-phenyl)-butylamino]-ethoxy}-chroman-4-ol | CHEMBL96714
TypeSmall organic molecule
Emp. Form.C22H28FNO4
Mol. Mass.389.4604
SMILESCOc1ccc(CCCCNCCOc2cc(F)cc3C(O)CCOc23)cc1